{"text_format":"1","workbook":"xlsx","n_sheets":3,"sheets":["Params","115200","Program"],"not_rendered":{"charts":0,"images":0,"macros":1,"external_links":0,"defined_names":3,"comments":0,"pivot_tables":0},"unopened":[],"bounds":{"document_bytes":16777216,"sheet_cells":100000,"rows_first":2000,"rows_last":500,"rows_between":2000,"halvings":0,"cell_chars":16384,"cell_head_chars":4096},"cells_cut":0,"cells_raw":0,"read":"whole","date_system":"1900"}

{"sheet":"Params","index":0,"n_rows":8,"n_cols":11,"rows_kept":8,"cut":false,"hidden":false,"merged":[]}
["F_CPU",16000000,null,"Cycle time (ns):",{"$f":"1000000000/B1","v":62.5}]
["BAUD",1382400,null,"Bit time (ns):",{"$f":"1000000000/B2","v":723.37962962962968}]
[]
["Message chars:","A","T","+","B","A","U","D",8]
["Ascii:",65,84,43,66,65,85,68,56]
["Bin:",{"$f":"DEC2BIN(B5,8)","v":"01000001"},{"$f":"DEC2BIN(C5,8)","v":"01010100"},"00101011","01000010","01000001","01010101","01000100","00111000"]
["Reversed bin:",{"$f":"rev(B6)","v":"10000010"},{"$f":"rev(C6)","v":"00101010"},"11010100","01000010","10000010","10101010","00100010","00011100","Message:","Check:"]
["Start+Rev+Stop:",{"$f":"\"0\"&B7&\"1\"","v":"0100000101"},{"$f":"\"0\"&C7&\"1\"","v":"0001010101"},"0110101001","0010000101","0100000101","0101010101","0001000101","0000111001",{"$f":"B8&C8&D8&E8&F8&G8&H8&I8","v":"01000001010001010101011010100100100001010100000101010101010100010001010000111001"},{"$f":"LEN(J8)","v":80}]

{"sheet":"115200","index":1,"n_rows":8,"n_cols":11,"rows_kept":8,"cut":false,"hidden":false,"merged":[]}
["F_CPU",16000000,null,"Cycle time (ns):",{"$f":"1000000000/B1","v":62.5}]
["BAUD",1382400,null,"Bit time (ns):",{"$f":"1000000000/B2","v":723.37962962962968}]
[]
["Message chars:","A","T","+","B","A","U","D",4]
["Ascii:",65,84,43,66,65,85,68,56]
["Bin:",{"$f":"DEC2BIN(B5,8)","v":"01000001"},{"$f":"DEC2BIN(C5,8)","v":"01010100"},"00101011","01000010","01000001","01010101","01000100","00111000"]
["Reversed bin:",{"$f":"rev(B6)","v":"10000010"},{"$f":"rev(C6)","v":"00101010"},"11010100","01000010","10000010","10101010","00100010","00011100","Message:","Check:"]
["Start+Rev+Stop:",{"$f":"\"0\"&B7&\"1\"","v":"0100000101"},{"$f":"\"0\"&C7&\"1\"","v":"0001010101"},"0110101001","0010000101","0100000101","0101010101","0001000101","0000111001",{"$f":"B8&C8&D8&E8&F8&G8&H8&I8","v":"01000001010001010101011010100100100001010100000101010101010100010001010000111001"},{"$f":"LEN(J8)","v":80}]

{"sheet":"Program","index":2,"n_rows":81,"n_cols":9,"rows_kept":81,"cut":false,"hidden":false,"merged":[]}
["Bit index","Bit value","Bit time (ns)","Cycle","Cycles (int)","Difference in cycles","Basic operation","Changed operation","code"]
[{"$f":"ROW()-1","v":1},{"$f":"MID(MSG,A2,1)","v":"0"},{"$f":"A2*BIT_TIME","v":723.37962962962968},{"$f":"C2/CYCLE_TIME","v":11.574074074074074},{"$f":"ROUND(D2,0)","v":12},{"$f":"E2","v":12},{"$f":"\"out 0x0B, r1\"&IF(B2=\"0\",\"6\",\"7\")","v":"out 0x0B, r16"},{"$f":"IF(B2=B1,\"nop\",G2)","v":"out 0x0B, r16"},{"$f":"_xludf.code(H2,F2-1)","v":"~out 0x0B, r16~ ~\\n\\t~\r\n~nop~ ~\\n\\t~\r\n~nop~ ~\\n\\t~\r\n~nop~ ~\\n\\t~\r\n~nop~ ~\\n\\t~\r\n~nop~ ~\\n\\t~\r\n~nop~ ~\\n\\t~\r\n~nop~ ~\\n\\t~\r\n~nop~ ~\\n\\t~\r\n~nop~ ~\\n\\t~\r\n~nop~ ~\\n\\t~\r\n~nop~ ~\\n\\t~\r\n"}]
[{"$f":"ROW()-1","v":2},"1",1446.7592592592594,23.148148148148149,{"$f":"ROUND(D3,0)","v":23},{"$f":"E3-E2","v":11},{"$f":"\"out 0x0B, r1\"&IF(B3=\"0\",\"6\",\"7\")","v":"out 0x0B, r17"},{"$f":"IF(B3=B2,\"nop\",G3)","v":"out 0x0B, r17"},{"$f":"_xludf.code(H3,F3-1)","v":"~out 0x0B, r17~ ~\\n\\t~\r\n~nop~ ~\\n\\t~\r\n~nop~ ~\\n\\t~\r\n~nop~ ~\\n\\t~\r\n~nop~ ~\\n\\t~\r\n~nop~ ~\\n\\t~\r\n~nop~ ~\\n\\t~\r\n~nop~ ~\\n\\t~\r\n~nop~ ~\\n\\t~\r\n~nop~ ~\\n\\t~\r\n~nop~ ~\\n\\t~\r\n"}]
[3,"0",2170.1388888888891,34.722222222222229,35,{"$f":"E4-E3","v":12},"out 0x0B, r16","out 0x0B, r16",{"$f":"_xludf.code(H4,F4-1)","v":"~out 0x0B, r16~ ~\\n\\t~\r\n~nop~ ~\\n\\t~\r\n~nop~ ~\\n\\t~\r\n~nop~ ~\\n\\t~\r\n~nop~ ~\\n\\t~\r\n~nop~ ~\\n\\t~\r\n~nop~ ~\\n\\t~\r\n~nop~ ~\\n\\t~\r\n~nop~ ~\\n\\t~\r\n~nop~ ~\\n\\t~\r\n~nop~ ~\\n\\t~\r\n~nop~ ~\\n\\t~\r\n"}]
[4,"0",2893.5185185185187,46.296296296296298,46,11,"out 0x0B, r16","nop","~nop~ ~\\n\\t~\r\n~nop~ ~\\n\\t~\r\n~nop~ ~\\n\\t~\r\n~nop~ ~\\n\\t~\r\n~nop~ ~\\n\\t~\r\n~nop~ ~\\n\\t~\r\n~nop~ ~\\n\\t~\r\n~nop~ ~\\n\\t~\r\n~nop~ ~\\n\\t~\r\n~nop~ ~\\n\\t~\r\n~nop~ ~\\n\\t~\r\n"]
[5,"0",3616.8981481481483,57.870370370370374,58,12,"out 0x0B, r16","nop","~nop~ ~\\n\\t~\r\n~nop~ ~\\n\\t~\r\n~nop~ ~\\n\\t~\r\n~nop~ ~\\n\\t~\r\n~nop~ ~\\n\\t~\r\n~nop~ ~\\n\\t~\r\n~nop~ ~\\n\\t~\r\n~nop~ ~\\n\\t~\r\n~nop~ ~\\n\\t~\r\n~nop~ ~\\n\\t~\r\n~nop~ ~\\n\\t~\r\n~nop~ ~\\n\\t~\r\n"]
[6,"0",4340.2777777777783,69.444444444444457,69,11,"out 0x0B, r16","nop","~nop~ ~\\n\\t~\r\n~nop~ ~\\n\\t~\r\n~nop~ ~\\n\\t~\r\n~nop~ ~\\n\\t~\r\n~nop~ ~\\n\\t~\r\n~nop~ ~\\n\\t~\r\n~nop~ ~\\n\\t~\r\n~nop~ ~\\n\\t~\r\n~nop~ ~\\n\\t~\r\n~nop~ ~\\n\\t~\r\n~nop~ ~\\n\\t~\r\n"]
[7,"0",5063.6574074074078,81.018518518518519,81,12,"out 0x0B, r16","nop","~nop~ ~\\n\\t~\r\n~nop~ ~\\n\\t~\r\n~nop~ ~\\n\\t~\r\n~nop~ ~\\n\\t~\r\n~nop~ ~\\n\\t~\r\n~nop~ ~\\n\\t~\r\n~nop~ ~\\n\\t~\r\n~nop~ ~\\n\\t~\r\n~nop~ ~\\n\\t~\r\n~nop~ ~\\n\\t~\r\n~nop~ ~\\n\\t~\r\n~nop~ ~\\n\\t~\r\n"]
[8,"1",5787.0370370370374,92.592592592592595,93,12,"out 0x0B, r17","out 0x0B, r17","~out 0x0B, r17~ ~\\n\\t~\r\n~nop~ ~\\n\\t~\r\n~nop~ ~\\n\\t~\r\n~nop~ ~\\n\\t~\r\n~nop~ ~\\n\\t~\r\n~nop~ ~\\n\\t~\r\n~nop~ ~\\n\\t~\r\n~nop~ ~\\n\\t~\r\n~nop~ ~\\n\\t~\r\n~nop~ ~\\n\\t~\r\n~nop~ ~\\n\\t~\r\n~nop~ ~\\n\\t~\r\n"]
[9,"0",6510.416666666667,104.16666666666667,104,11,"out 0x0B, r16","out 0x0B, r16","~out 0x0B, r16~ ~\\n\\t~\r\n~nop~ ~\\n\\t~\r\n~nop~ ~\\n\\t~\r\n~nop~ ~\\n\\t~\r\n~nop~ ~\\n\\t~\r\n~nop~ ~\\n\\t~\r\n~nop~ ~\\n\\t~\r\n~nop~ ~\\n\\t~\r\n~nop~ ~\\n\\t~\r\n~nop~ ~\\n\\t~\r\n~nop~ ~\\n\\t~\r\n"]
[10,"1",7233.7962962962965,115.74074074074075,116,12,"out 0x0B, r17","out 0x0B, r17","~out 0x0B, r17~ ~\\n\\t~\r\n~nop~ ~\\n\\t~\r\n~nop~ ~\\n\\t~\r\n~nop~ ~\\n\\t~\r\n~nop~ ~\\n\\t~\r\n~nop~ ~\\n\\t~\r\n~nop~ ~\\n\\t~\r\n~nop~ ~\\n\\t~\r\n~nop~ ~\\n\\t~\r\n~nop~ ~\\n\\t~\r\n~nop~ ~\\n\\t~\r\n~nop~ ~\\n\\t~\r\n"]
[11,"0",7957.1759259259261,127.31481481481482,127,11,"out 0x0B, r16","out 0x0B, r16","~out 0x0B, r16~ ~\\n\\t~\r\n~nop~ ~\\n\\t~\r\n~nop~ ~\\n\\t~\r\n~nop~ ~\\n\\t~\r\n~nop~ ~\\n\\t~\r\n~nop~ ~\\n\\t~\r\n~nop~ ~\\n\\t~\r\n~nop~ ~\\n\\t~\r\n~nop~ ~\\n\\t~\r\n~nop~ ~\\n\\t~\r\n~nop~ ~\\n\\t~\r\n"]
[12,"0",8680.5555555555566,138.88888888888891,139,12,"out 0x0B, r16","nop","~nop~ ~\\n\\t~\r\n~nop~ ~\\n\\t~\r\n~nop~ ~\\n\\t~\r\n~nop~ ~\\n\\t~\r\n~nop~ ~\\n\\t~\r\n~nop~ ~\\n\\t~\r\n~nop~ ~\\n\\t~\r\n~nop~ ~\\n\\t~\r\n~nop~ ~\\n\\t~\r\n~nop~ ~\\n\\t~\r\n~nop~ ~\\n\\t~\r\n~nop~ ~\\n\\t~\r\n"]
[13,"0",9403.9351851851861,150.46296296296299,150,11,"out 0x0B, r16","nop","~nop~ ~\\n\\t~\r\n~nop~ ~\\n\\t~\r\n~nop~ ~\\n\\t~\r\n~nop~ ~\\n\\t~\r\n~nop~ ~\\n\\t~\r\n~nop~ ~\\n\\t~\r\n~nop~ ~\\n\\t~\r\n~nop~ ~\\n\\t~\r\n~nop~ ~\\n\\t~\r\n~nop~ ~\\n\\t~\r\n~nop~ ~\\n\\t~\r\n"]
[14,"1",10127.314814814816,162.03703703703704,162,12,"out 0x0B, r17","out 0x0B, r17","~out 0x0B, r17~ ~\\n\\t~\r\n~nop~ ~\\n\\t~\r\n~nop~ ~\\n\\t~\r\n~nop~ ~\\n\\t~\r\n~nop~ ~\\n\\t~\r\n~nop~ ~\\n\\t~\r\n~nop~ ~\\n\\t~\r\n~nop~ ~\\n\\t~\r\n~nop~ ~\\n\\t~\r\n~nop~ ~\\n\\t~\r\n~nop~ ~\\n\\t~\r\n~nop~ ~\\n\\t~\r\n"]
[15,"0",10850.694444444445,173.61111111111111,174,12,"out 0x0B, r16","out 0x0B, r16","~out 0x0B, r16~ ~\\n\\t~\r\n~nop~ ~\\n\\t~\r\n~nop~ ~\\n\\t~\r\n~nop~ ~\\n\\t~\r\n~nop~ ~\\n\\t~\r\n~nop~ ~\\n\\t~\r\n~nop~ ~\\n\\t~\r\n~nop~ ~\\n\\t~\r\n~nop~ ~\\n\\t~\r\n~nop~ ~\\n\\t~\r\n~nop~ ~\\n\\t~\r\n~nop~ ~\\n\\t~\r\n"]
[16,"1",11574.074074074075,185.18518518518519,185,11,"out 0x0B, r17","out 0x0B, r17","~out 0x0B, r17~ ~\\n\\t~\r\n~nop~ ~\\n\\t~\r\n~nop~ ~\\n\\t~\r\n~nop~ ~\\n\\t~\r\n~nop~ ~\\n\\t~\r\n~nop~ ~\\n\\t~\r\n~nop~ ~\\n\\t~\r\n~nop~ ~\\n\\t~\r\n~nop~ ~\\n\\t~\r\n~nop~ ~\\n\\t~\r\n~nop~ ~\\n\\t~\r\n"]
[17,"0",12297.453703703704,196.75925925925927,197,12,"out 0x0B, r16","out 0x0B, r16","~out 0x0B, r16~ ~\\n\\t~\r\n~nop~ ~\\n\\t~\r\n~nop~ ~\\n\\t~\r\n~nop~ ~\\n\\t~\r\n~nop~ ~\\n\\t~\r\n~nop~ ~\\n\\t~\r\n~nop~ ~\\n\\t~\r\n~nop~ ~\\n\\t~\r\n~nop~ ~\\n\\t~\r\n~nop~ ~\\n\\t~\r\n~nop~ ~\\n\\t~\r\n~nop~ ~\\n\\t~\r\n"]
[18,"1",13020.833333333334,208.33333333333334,208,11,"out 0x0B, r17","out 0x0B, r17","~out 0x0B, r17~ ~\\n\\t~\r\n~nop~ ~\\n\\t~\r\n~nop~ ~\\n\\t~\r\n~nop~ ~\\n\\t~\r\n~nop~ ~\\n\\t~\r\n~nop~ ~\\n\\t~\r\n~nop~ ~\\n\\t~\r\n~nop~ ~\\n\\t~\r\n~nop~ ~\\n\\t~\r\n~nop~ ~\\n\\t~\r\n~nop~ ~\\n\\t~\r\n"]
[19,"0",13744.212962962964,219.90740740740742,220,12,"out 0x0B, r16","out 0x0B, r16","~out 0x0B, r16~ ~\\n\\t~\r\n~nop~ ~\\n\\t~\r\n~nop~ ~\\n\\t~\r\n~nop~ ~\\n\\t~\r\n~nop~ ~\\n\\t~\r\n~nop~ ~\\n\\t~\r\n~nop~ ~\\n\\t~\r\n~nop~ ~\\n\\t~\r\n~nop~ ~\\n\\t~\r\n~nop~ ~\\n\\t~\r\n~nop~ ~\\n\\t~\r\n~nop~ ~\\n\\t~\r\n"]
[20,"1",14467.592592592593,231.4814814814815,231,11,"out 0x0B, r17","out 0x0B, r17","~out 0x0B, r17~ ~\\n\\t~\r\n~nop~ ~\\n\\t~\r\n~nop~ ~\\n\\t~\r\n~nop~ ~\\n\\t~\r\n~nop~ ~\\n\\t~\r\n~nop~ ~\\n\\t~\r\n~nop~ ~\\n\\t~\r\n~nop~ ~\\n\\t~\r\n~nop~ ~\\n\\t~\r\n~nop~ ~\\n\\t~\r\n~nop~ ~\\n\\t~\r\n"]
[21,"0",15190.972222222223,243.05555555555557,243,12,"out 0x0B, r16","out 0x0B, r16","~out 0x0B, r16~ ~\\n\\t~\r\n~nop~ ~\\n\\t~\r\n~nop~ ~\\n\\t~\r\n~nop~ ~\\n\\t~\r\n~nop~ ~\\n\\t~\r\n~nop~ ~\\n\\t~\r\n~nop~ ~\\n\\t~\r\n~nop~ ~\\n\\t~\r\n~nop~ ~\\n\\t~\r\n~nop~ ~\\n\\t~\r\n~nop~ ~\\n\\t~\r\n~nop~ ~\\n\\t~\r\n"]
[22,"1",15914.351851851852,254.62962962962965,255,12,"out 0x0B, r17","out 0x0B, r17","~out 0x0B, r17~ ~\\n\\t~\r\n~nop~ ~\\n\\t~\r\n~nop~ ~\\n\\t~\r\n~nop~ ~\\n\\t~\r\n~nop~ ~\\n\\t~\r\n~nop~ ~\\n\\t~\r\n~nop~ ~\\n\\t~\r\n~nop~ ~\\n\\t~\r\n~nop~ ~\\n\\t~\r\n~nop~ ~\\n\\t~\r\n~nop~ ~\\n\\t~\r\n~nop~ ~\\n\\t~\r\n"]
[23,"1",16637.731481481482,266.2037037037037,266,11,"out 0x0B, r17","nop","~nop~ ~\\n\\t~\r\n~nop~ ~\\n\\t~\r\n~nop~ ~\\n\\t~\r\n~nop~ ~\\n\\t~\r\n~nop~ ~\\n\\t~\r\n~nop~ ~\\n\\t~\r\n~nop~ ~\\n\\t~\r\n~nop~ ~\\n\\t~\r\n~nop~ ~\\n\\t~\r\n~nop~ ~\\n\\t~\r\n~nop~ ~\\n\\t~\r\n"]
[24,"0",17361.111111111113,277.77777777777783,278,12,"out 0x0B, r16","out 0x0B, r16","~out 0x0B, r16~ ~\\n\\t~\r\n~nop~ ~\\n\\t~\r\n~nop~ ~\\n\\t~\r\n~nop~ ~\\n\\t~\r\n~nop~ ~\\n\\t~\r\n~nop~ ~\\n\\t~\r\n~nop~ ~\\n\\t~\r\n~nop~ ~\\n\\t~\r\n~nop~ ~\\n\\t~\r\n~nop~ ~\\n\\t~\r\n~nop~ ~\\n\\t~\r\n~nop~ ~\\n\\t~\r\n"]
[25,"1",18084.490740740741,289.35185185185185,289,11,"out 0x0B, r17","out 0x0B, r17","~out 0x0B, r17~ ~\\n\\t~\r\n~nop~ ~\\n\\t~\r\n~nop~ ~\\n\\t~\r\n~nop~ ~\\n\\t~\r\n~nop~ ~\\n\\t~\r\n~nop~ ~\\n\\t~\r\n~nop~ ~\\n\\t~\r\n~nop~ ~\\n\\t~\r\n~nop~ ~\\n\\t~\r\n~nop~ ~\\n\\t~\r\n~nop~ ~\\n\\t~\r\n"]
[26,"0",18807.870370370372,300.92592592592598,301,12,"out 0x0B, r16","out 0x0B, r16","~out 0x0B, r16~ ~\\n\\t~\r\n~nop~ ~\\n\\t~\r\n~nop~ ~\\n\\t~\r\n~nop~ ~\\n\\t~\r\n~nop~ ~\\n\\t~\r\n~nop~ ~\\n\\t~\r\n~nop~ ~\\n\\t~\r\n~nop~ ~\\n\\t~\r\n~nop~ ~\\n\\t~\r\n~nop~ ~\\n\\t~\r\n~nop~ ~\\n\\t~\r\n~nop~ ~\\n\\t~\r\n"]
[27,"1",19531.25,312.5,313,12,"out 0x0B, r17","out 0x0B, r17","~out 0x0B, r17~ ~\\n\\t~\r\n~nop~ ~\\n\\t~\r\n~nop~ ~\\n\\t~\r\n~nop~ ~\\n\\t~\r\n~nop~ ~\\n\\t~\r\n~nop~ ~\\n\\t~\r\n~nop~ ~\\n\\t~\r\n~nop~ ~\\n\\t~\r\n~nop~ ~\\n\\t~\r\n~nop~ ~\\n\\t~\r\n~nop~ ~\\n\\t~\r\n~nop~ ~\\n\\t~\r\n"]
[28,"0",20254.629629629631,324.07407407407408,324,11,"out 0x0B, r16","out 0x0B, r16","~out 0x0B, r16~ ~\\n\\t~\r\n~nop~ ~\\n\\t~\r\n~nop~ ~\\n\\t~\r\n~nop~ ~\\n\\t~\r\n~nop~ ~\\n\\t~\r\n~nop~ ~\\n\\t~\r\n~nop~ ~\\n\\t~\r\n~nop~ ~\\n\\t~\r\n~nop~ ~\\n\\t~\r\n~nop~ ~\\n\\t~\r\n~nop~ ~\\n\\t~\r\n"]
[29,"0",20978.009259259259,335.64814814814815,336,12,"out 0x0B, r16","nop","~nop~ ~\\n\\t~\r\n~nop~ ~\\n\\t~\r\n~nop~ ~\\n\\t~\r\n~nop~ ~\\n\\t~\r\n~nop~ ~\\n\\t~\r\n~nop~ ~\\n\\t~\r\n~nop~ ~\\n\\t~\r\n~nop~ ~\\n\\t~\r\n~nop~ ~\\n\\t~\r\n~nop~ ~\\n\\t~\r\n~nop~ ~\\n\\t~\r\n~nop~ ~\\n\\t~\r\n"]
[30,"1",21701.388888888891,347.22222222222223,347,11,"out 0x0B, r17","out 0x0B, r17","~out 0x0B, r17~ ~\\n\\t~\r\n~nop~ ~\\n\\t~\r\n~nop~ ~\\n\\t~\r\n~nop~ ~\\n\\t~\r\n~nop~ ~\\n\\t~\r\n~nop~ ~\\n\\t~\r\n~nop~ ~\\n\\t~\r\n~nop~ ~\\n\\t~\r\n~nop~ ~\\n\\t~\r\n~nop~ ~\\n\\t~\r\n~nop~ ~\\n\\t~\r\n"]
[31,"0",22424.768518518518,358.7962962962963,359,12,"out 0x0B, r16","out 0x0B, r16","~out 0x0B, r16~ ~\\n\\t~\r\n~nop~ ~\\n\\t~\r\n~nop~ ~\\n\\t~\r\n~nop~ ~\\n\\t~\r\n~nop~ ~\\n\\t~\r\n~nop~ ~\\n\\t~\r\n~nop~ ~\\n\\t~\r\n~nop~ ~\\n\\t~\r\n~nop~ ~\\n\\t~\r\n~nop~ ~\\n\\t~\r\n~nop~ ~\\n\\t~\r\n~nop~ ~\\n\\t~\r\n"]
[32,"0",23148.14814814815,370.37037037037038,370,11,"out 0x0B, r16","nop","~nop~ ~\\n\\t~\r\n~nop~ ~\\n\\t~\r\n~nop~ ~\\n\\t~\r\n~nop~ ~\\n\\t~\r\n~nop~ ~\\n\\t~\r\n~nop~ ~\\n\\t~\r\n~nop~ ~\\n\\t~\r\n~nop~ ~\\n\\t~\r\n~nop~ ~\\n\\t~\r\n~nop~ ~\\n\\t~\r\n~nop~ ~\\n\\t~\r\n"]
[33,{"$f":"MID(MSG,A34,1)","v":"1"},{"$f":"A34*BIT_TIME","v":23871.527777777781},{"$f":"C34/CYCLE_TIME","v":381.94444444444451},382,12,"out 0x0B, r17","out 0x0B, r17","~out 0x0B, r17~ ~\\n\\t~\r\n~nop~ ~\\n\\t~\r\n~nop~ ~\\n\\t~\r\n~nop~ ~\\n\\t~\r\n~nop~ ~\\n\\t~\r\n~nop~ ~\\n\\t~\r\n~nop~ ~\\n\\t~\r\n~nop~ ~\\n\\t~\r\n~nop~ ~\\n\\t~\r\n~nop~ ~\\n\\t~\r\n~nop~ ~\\n\\t~\r\n~nop~ ~\\n\\t~\r\n"]
[34,"0",24594.907407407409,393.51851851851853,394,12,"out 0x0B, r16","out 0x0B, r16","~out 0x0B, r16~ ~\\n\\t~\r\n~nop~ ~\\n\\t~\r\n~nop~ ~\\n\\t~\r\n~nop~ ~\\n\\t~\r\n~nop~ ~\\n\\t~\r\n~nop~ ~\\n\\t~\r\n~nop~ ~\\n\\t~\r\n~nop~ ~\\n\\t~\r\n~nop~ ~\\n\\t~\r\n~nop~ ~\\n\\t~\r\n~nop~ ~\\n\\t~\r\n~nop~ ~\\n\\t~\r\n"]
[35,"0",25318.28703703704,405.09259259259267,405,11,"out 0x0B, r16","nop","~nop~ ~\\n\\t~\r\n~nop~ ~\\n\\t~\r\n~nop~ ~\\n\\t~\r\n~nop~ ~\\n\\t~\r\n~nop~ ~\\n\\t~\r\n~nop~ ~\\n\\t~\r\n~nop~ ~\\n\\t~\r\n~nop~ ~\\n\\t~\r\n~nop~ ~\\n\\t~\r\n~nop~ ~\\n\\t~\r\n~nop~ ~\\n\\t~\r\n"]
[36,"0",26041.666666666668,416.66666666666669,417,12,"out 0x0B, r16","nop","~nop~ ~\\n\\t~\r\n~nop~ ~\\n\\t~\r\n~nop~ ~\\n\\t~\r\n~nop~ ~\\n\\t~\r\n~nop~ ~\\n\\t~\r\n~nop~ ~\\n\\t~\r\n~nop~ ~\\n\\t~\r\n~nop~ ~\\n\\t~\r\n~nop~ ~\\n\\t~\r\n~nop~ ~\\n\\t~\r\n~nop~ ~\\n\\t~\r\n~nop~ ~\\n\\t~\r\n"]
[37,"0",26765.046296296299,428.24074074074076,428,11,"out 0x0B, r16","nop","~nop~ ~\\n\\t~\r\n~nop~ ~\\n\\t~\r\n~nop~ ~\\n\\t~\r\n~nop~ ~\\n\\t~\r\n~nop~ ~\\n\\t~\r\n~nop~ ~\\n\\t~\r\n~nop~ ~\\n\\t~\r\n~nop~ ~\\n\\t~\r\n~nop~ ~\\n\\t~\r\n~nop~ ~\\n\\t~\r\n~nop~ ~\\n\\t~\r\n"]
[38,"1",27488.425925925927,439.81481481481484,440,12,"out 0x0B, r17","out 0x0B, r17","~out 0x0B, r17~ ~\\n\\t~\r\n~nop~ ~\\n\\t~\r\n~nop~ ~\\n\\t~\r\n~nop~ ~\\n\\t~\r\n~nop~ ~\\n\\t~\r\n~nop~ ~\\n\\t~\r\n~nop~ ~\\n\\t~\r\n~nop~ ~\\n\\t~\r\n~nop~ ~\\n\\t~\r\n~nop~ ~\\n\\t~\r\n~nop~ ~\\n\\t~\r\n~nop~ ~\\n\\t~\r\n"]
[39,"0",28211.805555555558,451.38888888888891,451,11,"out 0x0B, r16","out 0x0B, r16","~out 0x0B, r16~ ~\\n\\t~\r\n~nop~ ~\\n\\t~\r\n~nop~ ~\\n\\t~\r\n~nop~ ~\\n\\t~\r\n~nop~ ~\\n\\t~\r\n~nop~ ~\\n\\t~\r\n~nop~ ~\\n\\t~\r\n~nop~ ~\\n\\t~\r\n~nop~ ~\\n\\t~\r\n~nop~ ~\\n\\t~\r\n~nop~ ~\\n\\t~\r\n"]
[40,"1",28935.185185185186,462.96296296296299,463,12,"out 0x0B, r17","out 0x0B, r17","~out 0x0B, r17~ ~\\n\\t~\r\n~nop~ ~\\n\\t~\r\n~nop~ ~\\n\\t~\r\n~nop~ ~\\n\\t~\r\n~nop~ ~\\n\\t~\r\n~nop~ ~\\n\\t~\r\n~nop~ ~\\n\\t~\r\n~nop~ ~\\n\\t~\r\n~nop~ ~\\n\\t~\r\n~nop~ ~\\n\\t~\r\n~nop~ ~\\n\\t~\r\n~nop~ ~\\n\\t~\r\n"]
[41,"0",29658.564814814818,474.53703703703707,475,12,"out 0x0B, r16","out 0x0B, r16","~out 0x0B, r16~ ~\\n\\t~\r\n~nop~ ~\\n\\t~\r\n~nop~ ~\\n\\t~\r\n~nop~ ~\\n\\t~\r\n~nop~ ~\\n\\t~\r\n~nop~ ~\\n\\t~\r\n~nop~ ~\\n\\t~\r\n~nop~ ~\\n\\t~\r\n~nop~ ~\\n\\t~\r\n~nop~ ~\\n\\t~\r\n~nop~ ~\\n\\t~\r\n~nop~ ~\\n\\t~\r\n"]
[42,"1",30381.944444444445,486.11111111111114,486,11,"out 0x0B, r17","out 0x0B, r17","~out 0x0B, r17~ ~\\n\\t~\r\n~nop~ ~\\n\\t~\r\n~nop~ ~\\n\\t~\r\n~nop~ ~\\n\\t~\r\n~nop~ ~\\n\\t~\r\n~nop~ ~\\n\\t~\r\n~nop~ ~\\n\\t~\r\n~nop~ ~\\n\\t~\r\n~nop~ ~\\n\\t~\r\n~nop~ ~\\n\\t~\r\n~nop~ ~\\n\\t~\r\n"]
[43,"0",31105.324074074077,497.68518518518522,498,12,"out 0x0B, r16","out 0x0B, r16","~out 0x0B, r16~ ~\\n\\t~\r\n~nop~ ~\\n\\t~\r\n~nop~ ~\\n\\t~\r\n~nop~ ~\\n\\t~\r\n~nop~ ~\\n\\t~\r\n~nop~ ~\\n\\t~\r\n~nop~ ~\\n\\t~\r\n~nop~ ~\\n\\t~\r\n~nop~ ~\\n\\t~\r\n~nop~ ~\\n\\t~\r\n~nop~ ~\\n\\t~\r\n~nop~ ~\\n\\t~\r\n"]
[44,"0",31828.703703703704,509.2592592592593,509,11,"out 0x0B, r16","nop","~nop~ ~\\n\\t~\r\n~nop~ ~\\n\\t~\r\n~nop~ ~\\n\\t~\r\n~nop~ ~\\n\\t~\r\n~nop~ ~\\n\\t~\r\n~nop~ ~\\n\\t~\r\n~nop~ ~\\n\\t~\r\n~nop~ ~\\n\\t~\r\n~nop~ ~\\n\\t~\r\n~nop~ ~\\n\\t~\r\n~nop~ ~\\n\\t~\r\n"]
[45,"0",32552.083333333336,520.83333333333337,521,12,"out 0x0B, r16","nop","~nop~ ~\\n\\t~\r\n~nop~ ~\\n\\t~\r\n~nop~ ~\\n\\t~\r\n~nop~ ~\\n\\t~\r\n~nop~ ~\\n\\t~\r\n~nop~ ~\\n\\t~\r\n~nop~ ~\\n\\t~\r\n~nop~ ~\\n\\t~\r\n~nop~ ~\\n\\t~\r\n~nop~ ~\\n\\t~\r\n~nop~ ~\\n\\t~\r\n~nop~ ~\\n\\t~\r\n"]
[46,"0",33275.462962962964,532.40740740740739,532,11,"out 0x0B, r16","nop","~nop~ ~\\n\\t~\r\n~nop~ ~\\n\\t~\r\n~nop~ ~\\n\\t~\r\n~nop~ ~\\n\\t~\r\n~nop~ ~\\n\\t~\r\n~nop~ ~\\n\\t~\r\n~nop~ ~\\n\\t~\r\n~nop~ ~\\n\\t~\r\n~nop~ ~\\n\\t~\r\n~nop~ ~\\n\\t~\r\n~nop~ ~\\n\\t~\r\n"]
[47,"0",33998.842592592591,543.98148148148141,544,12,"out 0x0B, r16","nop","~nop~ ~\\n\\t~\r\n~nop~ ~\\n\\t~\r\n~nop~ ~\\n\\t~\r\n~nop~ ~\\n\\t~\r\n~nop~ ~\\n\\t~\r\n~nop~ ~\\n\\t~\r\n~nop~ ~\\n\\t~\r\n~nop~ ~\\n\\t~\r\n~nop~ ~\\n\\t~\r\n~nop~ ~\\n\\t~\r\n~nop~ ~\\n\\t~\r\n~nop~ ~\\n\\t~\r\n"]
[48,"1",34722.222222222226,555.55555555555566,556,12,"out 0x0B, r17","out 0x0B, r17","~out 0x0B, r17~ ~\\n\\t~\r\n~nop~ ~\\n\\t~\r\n~nop~ ~\\n\\t~\r\n~nop~ ~\\n\\t~\r\n~nop~ ~\\n\\t~\r\n~nop~ ~\\n\\t~\r\n~nop~ ~\\n\\t~\r\n~nop~ ~\\n\\t~\r\n~nop~ ~\\n\\t~\r\n~nop~ ~\\n\\t~\r\n~nop~ ~\\n\\t~\r\n~nop~ ~\\n\\t~\r\n"]
[49,"0",35445.601851851854,567.12962962962968,567,11,"out 0x0B, r16","out 0x0B, r16","~out 0x0B, r16~ ~\\n\\t~\r\n~nop~ ~\\n\\t~\r\n~nop~ ~\\n\\t~\r\n~nop~ ~\\n\\t~\r\n~nop~ ~\\n\\t~\r\n~nop~ ~\\n\\t~\r\n~nop~ ~\\n\\t~\r\n~nop~ ~\\n\\t~\r\n~nop~ ~\\n\\t~\r\n~nop~ ~\\n\\t~\r\n~nop~ ~\\n\\t~\r\n"]
[50,"1",36168.981481481482,578.7037037037037,579,12,"out 0x0B, r17","out 0x0B, r17","~out 0x0B, r17~ ~\\n\\t~\r\n~nop~ ~\\n\\t~\r\n~nop~ ~\\n\\t~\r\n~nop~ ~\\n\\t~\r\n~nop~ ~\\n\\t~\r\n~nop~ ~\\n\\t~\r\n~nop~ ~\\n\\t~\r\n~nop~ ~\\n\\t~\r\n~nop~ ~\\n\\t~\r\n~nop~ ~\\n\\t~\r\n~nop~ ~\\n\\t~\r\n~nop~ ~\\n\\t~\r\n"]
[51,"0",36892.361111111117,590.27777777777783,590,11,"out 0x0B, r16","out 0x0B, r16","~out 0x0B, r16~ ~\\n\\t~\r\n~nop~ ~\\n\\t~\r\n~nop~ ~\\n\\t~\r\n~nop~ ~\\n\\t~\r\n~nop~ ~\\n\\t~\r\n~nop~ ~\\n\\t~\r\n~nop~ ~\\n\\t~\r\n~nop~ ~\\n\\t~\r\n~nop~ ~\\n\\t~\r\n~nop~ ~\\n\\t~\r\n~nop~ ~\\n\\t~\r\n"]
[52,"1",37615.740740740745,601.85185185185196,602,12,"out 0x0B, r17","out 0x0B, r17","~out 0x0B, r17~ ~\\n\\t~\r\n~nop~ ~\\n\\t~\r\n~nop~ ~\\n\\t~\r\n~nop~ ~\\n\\t~\r\n~nop~ ~\\n\\t~\r\n~nop~ ~\\n\\t~\r\n~nop~ ~\\n\\t~\r\n~nop~ ~\\n\\t~\r\n~nop~ ~\\n\\t~\r\n~nop~ ~\\n\\t~\r\n~nop~ ~\\n\\t~\r\n~nop~ ~\\n\\t~\r\n"]
[53,"0",38339.120370370372,613.42592592592598,613,11,"out 0x0B, r16","out 0x0B, r16","~out 0x0B, r16~ ~\\n\\t~\r\n~nop~ ~\\n\\t~\r\n~nop~ ~\\n\\t~\r\n~nop~ ~\\n\\t~\r\n~nop~ ~\\n\\t~\r\n~nop~ ~\\n\\t~\r\n~nop~ ~\\n\\t~\r\n~nop~ ~\\n\\t~\r\n~nop~ ~\\n\\t~\r\n~nop~ ~\\n\\t~\r\n~nop~ ~\\n\\t~\r\n"]
[54,"1",39062.5,625,625,12,"out 0x0B, r17","out 0x0B, r17","~out 0x0B, r17~ ~\\n\\t~\r\n~nop~ ~\\n\\t~\r\n~nop~ ~\\n\\t~\r\n~nop~ ~\\n\\t~\r\n~nop~ ~\\n\\t~\r\n~nop~ ~\\n\\t~\r\n~nop~ ~\\n\\t~\r\n~nop~ ~\\n\\t~\r\n~nop~ ~\\n\\t~\r\n~nop~ ~\\n\\t~\r\n~nop~ ~\\n\\t~\r\n~nop~ ~\\n\\t~\r\n"]
[55,"0",39785.879629629635,636.57407407407413,637,12,"out 0x0B, r16","out 0x0B, r16","~out 0x0B, r16~ ~\\n\\t~\r\n~nop~ ~\\n\\t~\r\n~nop~ ~\\n\\t~\r\n~nop~ ~\\n\\t~\r\n~nop~ ~\\n\\t~\r\n~nop~ ~\\n\\t~\r\n~nop~ ~\\n\\t~\r\n~nop~ ~\\n\\t~\r\n~nop~ ~\\n\\t~\r\n~nop~ ~\\n\\t~\r\n~nop~ ~\\n\\t~\r\n~nop~ ~\\n\\t~\r\n"]
[56,"1",40509.259259259263,648.14814814814815,648,11,"out 0x0B, r17","out 0x0B, r17","~out 0x0B, r17~ ~\\n\\t~\r\n~nop~ ~\\n\\t~\r\n~nop~ ~\\n\\t~\r\n~nop~ ~\\n\\t~\r\n~nop~ ~\\n\\t~\r\n~nop~ ~\\n\\t~\r\n~nop~ ~\\n\\t~\r\n~nop~ ~\\n\\t~\r\n~nop~ ~\\n\\t~\r\n~nop~ ~\\n\\t~\r\n~nop~ ~\\n\\t~\r\n"]
[57,"0",41232.638888888891,659.72222222222229,660,12,"out 0x0B, r16","out 0x0B, r16","~out 0x0B, r16~ ~\\n\\t~\r\n~nop~ ~\\n\\t~\r\n~nop~ ~\\n\\t~\r\n~nop~ ~\\n\\t~\r\n~nop~ ~\\n\\t~\r\n~nop~ ~\\n\\t~\r\n~nop~ ~\\n\\t~\r\n~nop~ ~\\n\\t~\r\n~nop~ ~\\n\\t~\r\n~nop~ ~\\n\\t~\r\n~nop~ ~\\n\\t~\r\n~nop~ ~\\n\\t~\r\n"]
[58,"1",41956.018518518518,671.2962962962963,671,11,"out 0x0B, r17","out 0x0B, r17","~out 0x0B, r17~ ~\\n\\t~\r\n~nop~ ~\\n\\t~\r\n~nop~ ~\\n\\t~\r\n~nop~ ~\\n\\t~\r\n~nop~ ~\\n\\t~\r\n~nop~ ~\\n\\t~\r\n~nop~ ~\\n\\t~\r\n~nop~ ~\\n\\t~\r\n~nop~ ~\\n\\t~\r\n~nop~ ~\\n\\t~\r\n~nop~ ~\\n\\t~\r\n"]
[59,"0",42679.398148148153,682.87037037037044,683,12,"out 0x0B, r16","out 0x0B, r16","~out 0x0B, r16~ ~\\n\\t~\r\n~nop~ ~\\n\\t~\r\n~nop~ ~\\n\\t~\r\n~nop~ ~\\n\\t~\r\n~nop~ ~\\n\\t~\r\n~nop~ ~\\n\\t~\r\n~nop~ ~\\n\\t~\r\n~nop~ ~\\n\\t~\r\n~nop~ ~\\n\\t~\r\n~nop~ ~\\n\\t~\r\n~nop~ ~\\n\\t~\r\n~nop~ ~\\n\\t~\r\n"]
[60,"1",43402.777777777781,694.44444444444446,694,11,"out 0x0B, r17","out 0x0B, r17","~out 0x0B, r17~ ~\\n\\t~\r\n~nop~ ~\\n\\t~\r\n~nop~ ~\\n\\t~\r\n~nop~ ~\\n\\t~\r\n~nop~ ~\\n\\t~\r\n~nop~ ~\\n\\t~\r\n~nop~ ~\\n\\t~\r\n~nop~ ~\\n\\t~\r\n~nop~ ~\\n\\t~\r\n~nop~ ~\\n\\t~\r\n~nop~ ~\\n\\t~\r\n"]
[61,"0",44126.157407407409,706.01851851851859,706,12,"out 0x0B, r16","out 0x0B, r16","~out 0x0B, r16~ ~\\n\\t~\r\n~nop~ ~\\n\\t~\r\n~nop~ ~\\n\\t~\r\n~nop~ ~\\n\\t~\r\n~nop~ ~\\n\\t~\r\n~nop~ ~\\n\\t~\r\n~nop~ ~\\n\\t~\r\n~nop~ ~\\n\\t~\r\n~nop~ ~\\n\\t~\r\n~nop~ ~\\n\\t~\r\n~nop~ ~\\n\\t~\r\n~nop~ ~\\n\\t~\r\n"]
[62,"0",44849.537037037036,717.59259259259261,718,12,"out 0x0B, r16","nop","~nop~ ~\\n\\t~\r\n~nop~ ~\\n\\t~\r\n~nop~ ~\\n\\t~\r\n~nop~ ~\\n\\t~\r\n~nop~ ~\\n\\t~\r\n~nop~ ~\\n\\t~\r\n~nop~ ~\\n\\t~\r\n~nop~ ~\\n\\t~\r\n~nop~ ~\\n\\t~\r\n~nop~ ~\\n\\t~\r\n~nop~ ~\\n\\t~\r\n~nop~ ~\\n\\t~\r\n"]
[63,"0",45572.916666666672,729.16666666666674,729,11,"out 0x0B, r16","nop","~nop~ ~\\n\\t~\r\n~nop~ ~\\n\\t~\r\n~nop~ ~\\n\\t~\r\n~nop~ ~\\n\\t~\r\n~nop~ ~\\n\\t~\r\n~nop~ ~\\n\\t~\r\n~nop~ ~\\n\\t~\r\n~nop~ ~\\n\\t~\r\n~nop~ ~\\n\\t~\r\n~nop~ ~\\n\\t~\r\n~nop~ ~\\n\\t~\r\n"]
[64,"1",46296.296296296299,740.74074074074076,741,12,"out 0x0B, r17","out 0x0B, r17","~out 0x0B, r17~ ~\\n\\t~\r\n~nop~ ~\\n\\t~\r\n~nop~ ~\\n\\t~\r\n~nop~ ~\\n\\t~\r\n~nop~ ~\\n\\t~\r\n~nop~ ~\\n\\t~\r\n~nop~ ~\\n\\t~\r\n~nop~ ~\\n\\t~\r\n~nop~ ~\\n\\t~\r\n~nop~ ~\\n\\t~\r\n~nop~ ~\\n\\t~\r\n~nop~ ~\\n\\t~\r\n"]
[65,{"$f":"MID(MSG,A66,1)","v":"0"},{"$f":"A66*BIT_TIME","v":47019.675925925927},{"$f":"C66/CYCLE_TIME","v":752.31481481481478},752,11,"out 0x0B, r16","out 0x0B, r16","~out 0x0B, r16~ ~\\n\\t~\r\n~nop~ ~\\n\\t~\r\n~nop~ ~\\n\\t~\r\n~nop~ ~\\n\\t~\r\n~nop~ ~\\n\\t~\r\n~nop~ ~\\n\\t~\r\n~nop~ ~\\n\\t~\r\n~nop~ ~\\n\\t~\r\n~nop~ ~\\n\\t~\r\n~nop~ ~\\n\\t~\r\n~nop~ ~\\n\\t~\r\n"]
[{"$f":"ROW()-1","v":66},"0",47743.055555555562,763.88888888888903,{"$f":"ROUND(D67,0)","v":764},12,{"$f":"\"out 0x0B, r1\"&IF(B67=\"0\",\"6\",\"7\")","v":"out 0x0B, r16"},{"$f":"IF(B67=B66,\"nop\",G67)","v":"nop"},"~nop~ ~\\n\\t~\r\n~nop~ ~\\n\\t~\r\n~nop~ ~\\n\\t~\r\n~nop~ ~\\n\\t~\r\n~nop~ ~\\n\\t~\r\n~nop~ ~\\n\\t~\r\n~nop~ ~\\n\\t~\r\n~nop~ ~\\n\\t~\r\n~nop~ ~\\n\\t~\r\n~nop~ ~\\n\\t~\r\n~nop~ ~\\n\\t~\r\n~nop~ ~\\n\\t~\r\n"]
[67,"0",48466.43518518519,775.46296296296305,775,{"$f":"E68-E67","v":11},"out 0x0B, r16","nop",{"$f":"_xludf.code(H68,F68-1)","v":"~nop~ ~\\n\\t~\r\n~nop~ ~\\n\\t~\r\n~nop~ ~\\n\\t~\r\n~nop~ ~\\n\\t~\r\n~nop~ ~\\n\\t~\r\n~nop~ ~\\n\\t~\r\n~nop~ ~\\n\\t~\r\n~nop~ ~\\n\\t~\r\n~nop~ ~\\n\\t~\r\n~nop~ ~\\n\\t~\r\n~nop~ ~\\n\\t~\r\n"}]
[68,"1",49189.814814814818,787.03703703703707,787,12,"out 0x0B, r17","out 0x0B, r17","~out 0x0B, r17~ ~\\n\\t~\r\n~nop~ ~\\n\\t~\r\n~nop~ ~\\n\\t~\r\n~nop~ ~\\n\\t~\r\n~nop~ ~\\n\\t~\r\n~nop~ ~\\n\\t~\r\n~nop~ ~\\n\\t~\r\n~nop~ ~\\n\\t~\r\n~nop~ ~\\n\\t~\r\n~nop~ ~\\n\\t~\r\n~nop~ ~\\n\\t~\r\n~nop~ ~\\n\\t~\r\n"]
[69,"0",49913.194444444445,798.61111111111109,799,12,"out 0x0B, r16","out 0x0B, r16","~out 0x0B, r16~ ~\\n\\t~\r\n~nop~ ~\\n\\t~\r\n~nop~ ~\\n\\t~\r\n~nop~ ~\\n\\t~\r\n~nop~ ~\\n\\t~\r\n~nop~ ~\\n\\t~\r\n~nop~ ~\\n\\t~\r\n~nop~ ~\\n\\t~\r\n~nop~ ~\\n\\t~\r\n~nop~ ~\\n\\t~\r\n~nop~ ~\\n\\t~\r\n~nop~ ~\\n\\t~\r\n"]
[70,"1",50636.57407407408,810.18518518518533,810,11,"out 0x0B, r17","out 0x0B, r17","~out 0x0B, r17~ ~\\n\\t~\r\n~nop~ ~\\n\\t~\r\n~nop~ ~\\n\\t~\r\n~nop~ ~\\n\\t~\r\n~nop~ ~\\n\\t~\r\n~nop~ ~\\n\\t~\r\n~nop~ ~\\n\\t~\r\n~nop~ ~\\n\\t~\r\n~nop~ ~\\n\\t~\r\n~nop~ ~\\n\\t~\r\n~nop~ ~\\n\\t~\r\n"]
[71,"0",51359.953703703708,821.75925925925935,822,12,"out 0x0B, r16","out 0x0B, r16","~out 0x0B, r16~ ~\\n\\t~\r\n~nop~ ~\\n\\t~\r\n~nop~ ~\\n\\t~\r\n~nop~ ~\\n\\t~\r\n~nop~ ~\\n\\t~\r\n~nop~ ~\\n\\t~\r\n~nop~ ~\\n\\t~\r\n~nop~ ~\\n\\t~\r\n~nop~ ~\\n\\t~\r\n~nop~ ~\\n\\t~\r\n~nop~ ~\\n\\t~\r\n~nop~ ~\\n\\t~\r\n"]
[72,"0",52083.333333333336,833.33333333333337,833,11,"out 0x0B, r16","nop","~nop~ ~\\n\\t~\r\n~nop~ ~\\n\\t~\r\n~nop~ ~\\n\\t~\r\n~nop~ ~\\n\\t~\r\n~nop~ ~\\n\\t~\r\n~nop~ ~\\n\\t~\r\n~nop~ ~\\n\\t~\r\n~nop~ ~\\n\\t~\r\n~nop~ ~\\n\\t~\r\n~nop~ ~\\n\\t~\r\n~nop~ ~\\n\\t~\r\n"]
[73,"0",52806.712962962964,844.90740740740739,845,12,"out 0x0B, r16","nop","~nop~ ~\\n\\t~\r\n~nop~ ~\\n\\t~\r\n~nop~ ~\\n\\t~\r\n~nop~ ~\\n\\t~\r\n~nop~ ~\\n\\t~\r\n~nop~ ~\\n\\t~\r\n~nop~ ~\\n\\t~\r\n~nop~ ~\\n\\t~\r\n~nop~ ~\\n\\t~\r\n~nop~ ~\\n\\t~\r\n~nop~ ~\\n\\t~\r\n~nop~ ~\\n\\t~\r\n"]
[74,"0",53530.092592592599,856.48148148148152,856,11,"out 0x0B, r16","nop","~nop~ ~\\n\\t~\r\n~nop~ ~\\n\\t~\r\n~nop~ ~\\n\\t~\r\n~nop~ ~\\n\\t~\r\n~nop~ ~\\n\\t~\r\n~nop~ ~\\n\\t~\r\n~nop~ ~\\n\\t~\r\n~nop~ ~\\n\\t~\r\n~nop~ ~\\n\\t~\r\n~nop~ ~\\n\\t~\r\n~nop~ ~\\n\\t~\r\n"]
[75,"1",54253.472222222226,868.05555555555566,868,12,"out 0x0B, r17","out 0x0B, r17","~out 0x0B, r17~ ~\\n\\t~\r\n~nop~ ~\\n\\t~\r\n~nop~ ~\\n\\t~\r\n~nop~ ~\\n\\t~\r\n~nop~ ~\\n\\t~\r\n~nop~ ~\\n\\t~\r\n~nop~ ~\\n\\t~\r\n~nop~ ~\\n\\t~\r\n~nop~ ~\\n\\t~\r\n~nop~ ~\\n\\t~\r\n~nop~ ~\\n\\t~\r\n~nop~ ~\\n\\t~\r\n"]
[76,"1",54976.851851851854,879.62962962962968,880,12,"out 0x0B, r17","nop","~nop~ ~\\n\\t~\r\n~nop~ ~\\n\\t~\r\n~nop~ ~\\n\\t~\r\n~nop~ ~\\n\\t~\r\n~nop~ ~\\n\\t~\r\n~nop~ ~\\n\\t~\r\n~nop~ ~\\n\\t~\r\n~nop~ ~\\n\\t~\r\n~nop~ ~\\n\\t~\r\n~nop~ ~\\n\\t~\r\n~nop~ ~\\n\\t~\r\n~nop~ ~\\n\\t~\r\n"]
[77,"1",55700.231481481482,891.2037037037037,891,11,"out 0x0B, r17","nop","~nop~ ~\\n\\t~\r\n~nop~ ~\\n\\t~\r\n~nop~ ~\\n\\t~\r\n~nop~ ~\\n\\t~\r\n~nop~ ~\\n\\t~\r\n~nop~ ~\\n\\t~\r\n~nop~ ~\\n\\t~\r\n~nop~ ~\\n\\t~\r\n~nop~ ~\\n\\t~\r\n~nop~ ~\\n\\t~\r\n~nop~ ~\\n\\t~\r\n"]
[78,"0",56423.611111111117,902.77777777777783,903,12,"out 0x0B, r16","out 0x0B, r16","~out 0x0B, r16~ ~\\n\\t~\r\n~nop~ ~\\n\\t~\r\n~nop~ ~\\n\\t~\r\n~nop~ ~\\n\\t~\r\n~nop~ ~\\n\\t~\r\n~nop~ ~\\n\\t~\r\n~nop~ ~\\n\\t~\r\n~nop~ ~\\n\\t~\r\n~nop~ ~\\n\\t~\r\n~nop~ ~\\n\\t~\r\n~nop~ ~\\n\\t~\r\n~nop~ ~\\n\\t~\r\n"]
[79,"0",57146.990740740745,914.35185185185196,914,11,"out 0x0B, r16","nop","~nop~ ~\\n\\t~\r\n~nop~ ~\\n\\t~\r\n~nop~ ~\\n\\t~\r\n~nop~ ~\\n\\t~\r\n~nop~ ~\\n\\t~\r\n~nop~ ~\\n\\t~\r\n~nop~ ~\\n\\t~\r\n~nop~ ~\\n\\t~\r\n~nop~ ~\\n\\t~\r\n~nop~ ~\\n\\t~\r\n~nop~ ~\\n\\t~\r\n"]
[80,"1",57870.370370370372,925.92592592592598,926,12,"out 0x0B, r17","out 0x0B, r17","~out 0x0B, r17~ ~\\n\\t~\r\n~nop~ ~\\n\\t~\r\n~nop~ ~\\n\\t~\r\n~nop~ ~\\n\\t~\r\n~nop~ ~\\n\\t~\r\n~nop~ ~\\n\\t~\r\n~nop~ ~\\n\\t~\r\n~nop~ ~\\n\\t~\r\n~nop~ ~\\n\\t~\r\n~nop~ ~\\n\\t~\r\n~nop~ ~\\n\\t~\r\n~nop~ ~\\n\\t~\r\n"]